BDBM60945 5-amino-6-[(Z)-(3-hydroxy-4-keto-cyclohexa-2,5-dien-1-ylidene)methyl]-2-(2-keto-2-pyrrolidino-ethyl)-[1,3,4]thiadiazolo[3,2-a]pyrimidin-7-one::5-amino-6-[(Z)-(3-hydroxy-4-oxo-1-cyclohexa-2,5-dienylidene)methyl]-2-[2-oxo-2-(1-pyrrolidinyl)ethyl]-[1,3,4]thiadiazolo[3,2-a]pyrimidin-7-one::5-amino-6-[(Z)-(3-hydroxy-4-oxocyclohexa-2,5-dien-1-ylidene)methyl]-2-(2-oxo-2-pyrrolidin-1-ylethyl)-[1,3,4]thiadiazolo[3,2-a]pyrimidin-7-one::5-azanyl-2-(2-oxidanylidene-2-pyrrolidin-1-yl-ethyl)-6-[(Z)-(3-oxidanyl-4-oxidanylidene-cyclohexa-2,5-dien-1-ylidene)methyl]-[1,3,4]thiadiazolo[3,2-a]pyrimidin-7-one::MLS001139292::SMR000647271::cid_17575181
SMILES Nc1c(\C=C2\C=CC(=O)C(O)=C2)c(=O)nc2sc(CC(=O)N3CCCC3)nn12
InChI Key InChIKey=XZMKRKKKKNCQQY-YFHOEESVSA-N
Data  4 EC50
  Tab Delimited (TSV)   2D SDfile   Computed 3D by Vconf -m prep SDfile
Find this compound or compounds like it in BindingDB:
Activity Spreadsheet -- Enzyme Inhibition Constant Data from BindingDB
Found 4 hits for monomerid = 60945
TargetIntestinal-type alkaline phosphatase(Homo sapiens (Human))
Burnham Center For Chemical Genomics
Curated by PubChem BioAssay
LigandPNGBDBM60945(5-amino-6-[(Z)-(3-hydroxy-4-keto-cyclohexa-2,5-die...)
Affinity DataEC50:  9.70E+3nM. Assay description: Data Source: Sanford-Burnham Center for Chemical Genomics (SBCCG) Source Affiliation: Sanford-Burnham Medical Research Institute (SBMRI, San Diego, C...
In DepthDetails PCBioAssay
TargetIntestinal-type alkaline phosphatase 1(Rattus norvegicus (Rat))
Burnham Center For Chemical Genomics
Curated by PubChem BioAssay
LigandPNGBDBM60945(5-amino-6-[(Z)-(3-hydroxy-4-keto-cyclohexa-2,5-die...)
Affinity DataEC50: >1.00E+5nM. Assay description: Data Source: Sanford-Burnham Center for Chemical Genomics (SBCCG) Source Affiliation: Sanford-Burnham Medical Research Institute (SBMRI, San Diego, C...
In DepthDetails PCBioAssay
TargetAlkaline phosphatase, tissue-nonspecific isozyme(Homo sapiens (Human))
Burnham Center For Chemical Genomics
Curated by PubChem BioAssay
LigandPNGBDBM60945(5-amino-6-[(Z)-(3-hydroxy-4-keto-cyclohexa-2,5-die...)
Affinity DataEC50:  9.20E+3nM. Assay description: Data Source: Sanford-Burnham Center for Chemical Genomics (SBCCG) Source Affiliation: Sanford-Burnham Medical Research Institute (SBMRI, San Diego, C...
In DepthDetails PCBioAssay
TargetAlkaline phosphatase, germ cell type(Homo sapiens (Human))
Burnham Center For Chemical Genomics
Curated by PubChem BioAssay
LigandPNGBDBM60945(5-amino-6-[(Z)-(3-hydroxy-4-keto-cyclohexa-2,5-die...)
Affinity DataEC50:  9.83E+3nM. Assay description: Data Source: Sanford-Burnham Center for Chemical Genomics (SBCCG) Source Affiliation: Sanford-Burnham Medical Research Institute (SBMRI, San Diego, C...
In DepthDetails PCBioAssay