BDBM6097 4-[(2,4-dichloro-5-methoxyphenyl)amino]-6-methoxy-7-[(1-methylpiperidin-4-yl)oxy]quinoline-3-carbonitrile::4-phenylamino-3-quinolinecarbonitrile 8
SMILES COc1cc(Nc2c(cnc3cc(OC4CCN(C)CC4)c(OC)cc23)C#N)c(Cl)cc1Cl
InChI Key InChIKey=SRTONYAWGLMSSN-UHFFFAOYSA-N
Data  4 IC50
  Tab Delimited (TSV)   2D SDfile   Computed 3D by Vconf -m prep SDfile
Find this compound or compounds like it in BindingDB:
Activity Spreadsheet -- Enzyme Inhibition Constant Data from BindingDB
Found 4 hits for monomerid = 6097
TargetProto-oncogene tyrosine-protein kinase Src(Homo sapiens (Human))
Wyeth Research
LigandPNGBDBM6097(4-[(2,4-dichloro-5-methoxyphenyl)amino]-6-methoxy-...)
Affinity DataIC50:  230nM. Assay description: Kinase assays were performed using the europium/APC detection format (LANCE, Perkin Elmer). HTRF is based on the proximity of europium cryptate (dono...
In DepthDetails ArticlePubMed
TargetProto-oncogene tyrosine-protein kinase Src(Homo sapiens (Human))
Wyeth Research
LigandPNGBDBM6097(4-[(2,4-dichloro-5-methoxyphenyl)amino]-6-methoxy-...)
Affinity DataIC50:  230nM. Assay description: Inhibition of recombinant human Src kinase
In DepthDetails ArticlePubMed
TargetTyrosine-protein kinase ABL1/ABL2(Homo sapiens (Human))
Wyeth Research
Curated by ChEMBL
LigandPNGBDBM6097(4-[(2,4-dichloro-5-methoxyphenyl)amino]-6-methoxy-...)
Affinity DataIC50:  89nM. Assay description: Inhibition of Abl kinase
In DepthDetails ArticlePubMed
TargetTyrosine-protein kinase ABL1(Homo sapiens (Human))
Wyeth Research
LigandPNGBDBM6097(4-[(2,4-dichloro-5-methoxyphenyl)amino]-6-methoxy-...)
Affinity DataIC50:  89nM. Assay description: Kinase assays were performed using the europium/APC detection format (LANCE, Perkin Elmer). HTRF is based on the proximity of europium cryptate (dono...
In DepthDetails ArticlePubMed