BDBM6114 3-quinolinecarbonitrile analog 2b::4-[(2,4-dichloro-5-methoxyphenyl)amino]-7-{5-[(4-methylpiperazin-1-yl)methyl]thiophen-2-yl}quinoline-3-carbonitrile::7-thienyl-3-quinolinecarbonitrile 16
SMILES COc1cc(Nc2c(cnc3cc(ccc23)-c2ccc(CN3CCN(C)CC3)s2)C#N)c(Cl)cc1Cl
InChI Key InChIKey=JIHWYZNENLBYIH-UHFFFAOYSA-N
Data  2 IC50
  Tab Delimited (TSV)   2D SDfile   Computed 3D by Vconf -m prep SDfile
Find this compound or compounds like it in BindingDB:
Activity Spreadsheet -- Enzyme Inhibition Constant Data from BindingDB
Found 2 hits for monomerid = 6114
TargetProto-oncogene tyrosine-protein kinase Src(Homo sapiens (Human))
Wyeth Research
LigandPNGBDBM6114(3-quinolinecarbonitrile analog 2b | 4-[(2,4-dichlo...)
Affinity DataIC50:  2.30nMpH: 7.5 T: 2°C. Assay description: Kinase assays were performed using the europium/APC detection format (LANCE, Perkin Elmer). HTRF is based on the proximity of europium cryptate (dono...
In DepthDetails ArticlePubMed
TargetProto-oncogene tyrosine-protein kinase Src(Homo sapiens (Human))
Wyeth Research
LigandPNGBDBM6114(3-quinolinecarbonitrile analog 2b | 4-[(2,4-dichlo...)
Affinity DataIC50:  3.80nMpH: 7.5 T: 2°C. Assay description: Src kinase activity was measured in an ELISA format. IC50 is the inhibitor concentration which inhibits 50% of kinase activity that catalyzes the tra...
In DepthDetails ArticlePubMed