BDBM6122 3-quinolinecarbonitrile 8::4-[(2,4-dichloro-5-methoxyphenyl)amino]-6,7-bis(2-methoxyethoxy)quinoline-3-carbonitrile
SMILES COCCOc1cc2ncc(C#N)c(Nc3cc(OC)c(Cl)cc3Cl)c2cc1OCCOC
InChI Key InChIKey=VXEOIAFZWQMOEP-UHFFFAOYSA-N
Data  1 IC50
  Tab Delimited (TSV)   2D SDfile   Computed 3D by Vconf -m prep SDfile
Find this compound or compounds like it in BindingDB:
Activity Spreadsheet -- Enzyme Inhibition Constant Data from BindingDB
Found 1 hit for monomerid = 6122
TargetProto-oncogene tyrosine-protein kinase Src(Homo sapiens (Human))
Wyeth Research
LigandPNGBDBM6122(3-quinolinecarbonitrile 8 | 4-[(2,4-dichloro-5-met...)
Affinity DataIC50:  2.80nM. Assay description: Src kinase activity was measured in an ELISA format. IC50 is the inhibitor concentration which inhibits 50% of kinase activity that catalyzes the tra...
In DepthDetails ArticlePubMed