BDBM61491 3,3-bis(4-hydroxyphenyl)-7-methyl-1,3-dihydro-2H-indol-2-one::3,3-bis(4-hydroxyphenyl)-7-methyl-1H-indol-2-one::3,3-bis(4-hydroxyphenyl)-7-methyl-oxindole::MLS000573319::SMR000194821::cid_3860640
SMILES Cc1cccc2c1NC(=O)C2(c1ccc(O)cc1)c1ccc(O)cc1
InChI Key InChIKey=FABLAHMQSQFDHR-UHFFFAOYSA-N
Data  1 IC50
  Tab Delimited (TSV)   2D SDfile   Computed 3D by Vconf -m prep SDfile
Find this compound or compounds like it in BindingDB:
Activity Spreadsheet -- Enzyme Inhibition Constant Data from BindingDB
Found 1 hit for monomerid = 61491
TargetG-protein coupled receptor 55(Homo sapiens (Human))
Burnham Center For Chemical Genomics
Curated by PubChem BioAssay
LigandPNGBDBM61491(3,3-bis(4-hydroxyphenyl)-7-methyl-1,3-dihydro-2H-i...)
Affinity DataIC50:  2.53E+3nM. Assay description: Data Source: Sanford-Burnham Center for Chemical Genomics (SBCCG) Source Affiliation: Sanford-Burnham Medical Research Institute (SBMRI, San Diego, C...
In DepthDetails PCBioAssay