BDBM61574 (5-methyl-2,3-diphenyl-pyrazolo[1,5-a]pyrimidin-7-yl)amine::5-methyl-2,3-diphenyl-7-pyrazolo[1,5-a]pyrimidinamine::5-methyl-2,3-diphenyl-pyrazolo[1,5-a]pyrimidin-7-amine::5-methyl-2,3-diphenylpyrazolo[1,5-a]pyrimidin-7-amine::MLS001183805::SMR000503181::cid_4284019
SMILES Cc1cc(N)n2nc(c(-c3ccccc3)c2n1)-c1ccccc1
InChI Key InChIKey=BPILEAWNRDHBFJ-UHFFFAOYSA-N
Data  1 IC50
  Tab Delimited (TSV)   2D SDfile   Computed 3D by Vconf -m prep SDfile
Find this compound or compounds like it in BindingDB:
Activity Spreadsheet -- Enzyme Inhibition Constant Data from BindingDB
Found 1 hit for monomerid = 61574
TargetG-protein coupled receptor 55(Homo sapiens (Human))
Burnham Center For Chemical Genomics
Curated by PubChem BioAssay
LigandPNGBDBM61574((5-methyl-2,3-diphenyl-pyrazolo[1,5-a]pyrimidin-7-...)
Affinity DataIC50:  2.35E+3nM. Assay description: Data Source: Sanford-Burnham Center for Chemical Genomics (SBCCG) Source Affiliation: Sanford-Burnham Medical Research Institute (SBMRI, San Diego, C...
In DepthDetails PCBioAssay