BDBM61621 (5Z)-3-(2-methoxyethyl)-5-(4-pyrrolidinobenzylidene)-2-thioxo-thiazolidin-4-one::(5Z)-3-(2-methoxyethyl)-5-[(4-pyrrolidin-1-ylphenyl)methylidene]-2-sulfanylidene-1,3-thiazolidin-4-one::(5Z)-3-(2-methoxyethyl)-5-[[4-(1-pyrrolidinyl)phenyl]methylidene]-2-sulfanylidene-4-thiazolidinone::3-(2-methoxyethyl)-5-[4-(1-pyrrolidinyl)benzylidene]-2-thioxo-1,3-thiazolidin-4-one::MLS000662507::SMR000292273::cid_2189900
SMILES COCCN1C(=S)S\C(=C/c2ccc(cc2)N2CCCC2)C1=O
InChI Key InChIKey=SQMPCYRUSGBSIS-QINSGFPZSA-N
Data  1 IC50  2 EC50
  Tab Delimited (TSV)   2D SDfile   Computed 3D by Vconf -m prep SDfile
Find this compound or compounds like it in BindingDB:
Activity Spreadsheet -- Enzyme Inhibition Constant Data from BindingDB
Found 3 hits for monomerid = 61621
TargetG-protein coupled receptor 35(Homo sapiens (Human))
Burnham Center For Chemical Genomics
Curated by PubChem BioAssay
LigandPNGBDBM61621((5Z)-3-(2-methoxyethyl)-5-(4-pyrrolidinobenzyliden...)
Affinity DataIC50:  500nM. Assay description: Data Source: Sanford-Burnham Center for Chemical Genomics (SBCCG) Source Affiliation: Sanford-Burnham Medical Research Institute (SBMRI, San Diego, C...
In DepthDetails PCBioAssay
TargetEndoribonuclease toxin MazF(Escherichia coli str. K-12 substr. MG1655)
Burnham Center For Chemical Genomics
Curated by PubChem BioAssay
LigandPNGBDBM61621((5Z)-3-(2-methoxyethyl)-5-(4-pyrrolidinobenzyliden...)
Affinity DataEC50: >9.90E+4nM. Assay description: Data Source: Sanford-Burnham Center for Chemical Genomics (SBCCG) Source Affiliation: Sanford-Burnham Medical Research Institute (SBMRI, San Diego, C...
In DepthDetails PCBioAssay
TargetEndoribonuclease toxin MazF(Escherichia coli str. K-12 substr. MG1655)
Burnham Center For Chemical Genomics
Curated by PubChem BioAssay
LigandPNGBDBM61621((5Z)-3-(2-methoxyethyl)-5-(4-pyrrolidinobenzyliden...)
Affinity DataEC50: >9.90E+4nM. Assay description: Data Source: Sanford-Burnham Center for Chemical Genomics (SBCCG) Source Affiliation: Sanford-Burnham Medical Research Institute (SBMRI, San Diego, C...
In DepthDetails PCBioAssay