BDBM62063 MLS000083794::N-(5-bromanyl-1-butyl-2-oxidanylidene-3H-indol-3-yl)ethanamide::N-(5-bromo-1-butyl-2-keto-indolin-3-yl)acetamide::N-(5-bromo-1-butyl-2-oxo-3H-indol-3-yl)acetamide::SMR000046229::cid_665257
SMILES CCCCN1C(=O)C(NC(C)=O)c2cc(Br)ccc12
InChI Key InChIKey=CXCGQPLUFMSASL-UHFFFAOYSA-N
Data  1 IC50  1 EC50
  Tab Delimited (TSV)   2D SDfile   Computed 3D by Vconf -m prep SDfile
Find this compound or compounds like it in BindingDB:
Activity Spreadsheet -- Enzyme Inhibition Constant Data from BindingDB
Found 2 hits for monomerid = 62063
TargetBcl-2-like protein 11(Homo sapiens (Human))
Broad Institute
Curated by PubChem BioAssay
LigandPNGBDBM62063(MLS000083794 | N-(5-bromanyl-1-butyl-2-oxidanylide...)
Affinity DataEC50: >3.50E+5nM. Assay description: Keywords: apoptosis, BH3 domain, Bcl2-A1, BIM, caspase, cancer Primary Collaborator: Todd Golub, Broad Institute, golub@broadinstitute.org Assay Over...
In DepthDetails PCBioAssay
TargetNeuropeptides B/W receptor type 1(Homo sapiens (Human))
The Scripps Research Institute Molecular Screening Center
Curated by PubChem BioAssay
LigandPNGBDBM62063(MLS000083794 | N-(5-bromanyl-1-butyl-2-oxidanylide...)
Affinity DataIC50:  4.38E+4nM. Assay description: Source (MLPCN Center Name): The Scripps Research Institute Molecular Screening Center (SRIMSC) Affiliation: The Scripps Research Institute, TSRI Assa...
In DepthDetails PCBioAssay