BDBM62266 MLS-0243469.0001::N-cyclohexyl-2-[(4-keto-5-phenyl-3H-thieno[2,3-d]pyrimidin-2-yl)thio]acetamide::N-cyclohexyl-2-[(4-oxidanylidene-5-phenyl-3H-thieno[2,3-d]pyrimidin-2-yl)sulfanyl]ethanamide::N-cyclohexyl-2-[(4-oxo-5-phenyl-3H-thieno[2,3-d]pyrimidin-2-yl)sulfanyl]acetamide::N-cyclohexyl-2-[(4-oxo-5-phenyl-3H-thieno[2,3-d]pyrimidin-2-yl)thio]acetamide::cid_2301828
SMILES O=C(CSc1nc2scc(-c3ccccc3)c2c(=O)[nH]1)NC1CCCCC1
InChI Key InChIKey=BREJBBFHYPPRNY-UHFFFAOYSA-N
Data  2 IC50
  Tab Delimited (TSV)   2D SDfile   Computed 3D by Vconf -m prep SDfile
Find this compound or compounds like it in BindingDB:
Activity Spreadsheet -- Enzyme Inhibition Constant Data from BindingDB
Found 2 hits for monomerid = 62266
TargetTumor necrosis factor(Homo sapiens (Human))
Burnham Center For Chemical Genomics
Curated by PubChem BioAssay
LigandPNGBDBM62266(MLS-0243469.0001 | N-cyclohexyl-2-[(4-keto-5-pheny...)
Affinity DataIC50: >2.00E+4nM. Assay description: Data Source: Sanford-Burnham Center for Chemical Genomics (SBCCG) Source Affiliation: Sanford-Burnham Medical Research Institute (SBMRI, San Diego, C...
In DepthDetails PCBioAssay
TargetNucleotide-binding oligomerization domain-containing protein 1(Homo sapiens (Human))
Burnham Center For Chemical Genomics
Curated by PubChem BioAssay
LigandPNGBDBM62266(MLS-0243469.0001 | N-cyclohexyl-2-[(4-keto-5-pheny...)
Affinity DataIC50:  2.00E+4nM. Assay description: Data Source: Sanford-Burnham Center for Chemical Genomics (SBCCG) Source Affiliation: Sanford-Burnham Medical Research Institute (SBMRI, San Diego, C...
In DepthDetails PCBioAssay