BDBM62646 1-[1-[[5-(4-chlorophenyl)-1,3,4-oxadiazol-2-yl]methyl]-2-benzimidazolyl]ethanol::1-[1-[[5-(4-chlorophenyl)-1,3,4-oxadiazol-2-yl]methyl]benzimidazol-2-yl]ethanol::MLS000056178::SMR000068053::cid_2999835
SMILES CC(O)c1nc2ccccc2n1Cc1nnc(o1)-c1ccc(Cl)cc1
InChI Key InChIKey=SAPOCDSZEOUDOK-UHFFFAOYSA-N
Data  1 EC50
  Tab Delimited (TSV)   2D SDfile   Computed 3D by Vconf -m prep SDfile
Find this compound or compounds like it in BindingDB:
Activity Spreadsheet -- Enzyme Inhibition Constant Data from BindingDB
Found 1 hit for monomerid = 62646
TargetHeat shock factor protein 1(Mus musculus)
Broad Institute
Curated by PubChem BioAssay
LigandPNGBDBM62646(1-[1-[[5-(4-chlorophenyl)-1,3,4-oxadiazol-2-yl]met...)
Affinity DataEC50: >1.95E+5nM. Assay description: Keywords: Heat Shock Factor-1 (HSF-1), Stress Response, MG132, NIH3T3, Luminescence Assay Overview: Modified NIH3T3, transformed to express firefly...
In DepthDetails PCBioAssay