BDBM62872 4-(4-hydroxy-3-methoxy-phenyl)-2-keto-6-methyl-3,4-dihydro-1H-pyrimidine-5-carboxylic acid tetrahydrofurfuryl ester::4-(4-hydroxy-3-methoxyphenyl)-6-methyl-2-oxo-3,4-dihydro-1H-pyrimidine-5-carboxylic acid 2-oxolanylmethyl ester::MLS000107446::SMR000111814::cid_2855572::oxolan-2-ylmethyl 4-(3-methoxy-4-oxidanyl-phenyl)-6-methyl-2-oxidanylidene-3,4-dihydro-1H-pyrimidine-5-carboxylate::oxolan-2-ylmethyl 4-(4-hydroxy-3-methoxyphenyl)-6-methyl-2-oxo-3,4-dihydro-1H-pyrimidine-5-carboxylate
SMILES COc1cc(ccc1O)C1NC(=O)N=C(C)C1C(=O)OCC1CCCO1
InChI Key InChIKey=URKIJZDHSLOSIT-UHFFFAOYSA-N
Data  1 EC50
  Tab Delimited (TSV)   2D SDfile   Computed 3D by Vconf -m prep SDfile
Find this compound or compounds like it in BindingDB:
Activity Spreadsheet -- Enzyme Inhibition Constant Data from BindingDB
Found 1 hit for monomerid = 62872
TargetHeat shock factor protein 1(Mus musculus)
Broad Institute
Curated by PubChem BioAssay
LigandPNGBDBM62872(4-(4-hydroxy-3-methoxy-phenyl)-2-keto-6-methyl-3,4...)
Affinity DataEC50: >1.95E+5nM. Assay description: Keywords: Heat Shock Factor-1 (HSF-1), Stress Response, MG132, NIH3T3, Luminescence Assay Overview: Modified NIH3T3, transformed to express firefly...
In DepthDetails PCBioAssay