BDBM6319 6-Acetyl-8-cyclopentyl-2-[5-(3,3-dimethyl-piperazin-1-yl)-pyridin-2-ylamino]-5-methyl-8H-pyrido[2,3-d]pyrimidin-7-one Hydrochloride::8-cyclopentyl-2-{[5-(3,3-dimethylpiperazin-1-yl)pyridin-2-yl]amino}-6-acetyl-5-methyl-7H,8H-pyrido[2,3-d]pyrimidin-7-one::Pyrido-[2,3-d]-pyrimidin-7-one 53
SMILES CC(=O)c1c(C)c2cnc(Nc3ccc(cn3)N3CCNC(C)(C)C3)nc2n(C2CCCC2)c1=O
InChI Key InChIKey=XKOXAHQCOHATFB-UHFFFAOYSA-N
Data  2 IC50
  Tab Delimited (TSV)   2D SDfile   Computed 3D by Vconf -m prep SDfile
Find this compound or compounds like it in BindingDB:
Activity Spreadsheet -- Enzyme Inhibition Constant Data from BindingDB
Found 2 hits for monomerid = 6319
TargetCyclin-A2/Cyclin-dependent kinase 2(Homo sapiens (Human))
Pfizer
LigandPNGBDBM6319(6-Acetyl-8-cyclopentyl-2-[5-(3,3-dimethyl-piperazi...)
Affinity DataIC50: >5.00E+3nM. Assay description: The enzyme was assayed with substrate GST- retinoblastoma in the presence of 12 uM ATP/[gamma-32P] ATP. IC50 is the inhibitor concentration, which in...
In DepthDetails ArticlePubMed
LigandPNGBDBM6319(6-Acetyl-8-cyclopentyl-2-[5-(3,3-dimethyl-piperazi...)
Affinity DataIC50:  21nM. Assay description: The enzyme was assayed with substrate GST- retinoblastoma in the presence of 25 uM ATP/[gamma-32P] ATP. IC50 is the inhibitor concentration, which in...
In DepthDetails ArticlePubMed