BDBM63428 2-[3,5-dimethyl-4-[[2-(4-nitrophenoxy)-1-oxoethyl]amino]-1-pyrazolyl]acetic acid ethyl ester::2-[3,5-dimethyl-4-[[2-(4-nitrophenoxy)acetyl]amino]pyrazol-1-yl]acetic acid ethyl ester::MLS000729165::SMR000307443::cid_1506995::ethyl (3,5-dimethyl-4-{[(4-nitrophenoxy)acetyl]amino}-1H-pyrazol-1-yl)acetate::ethyl 2-[3,5-dimethyl-4-[2-(4-nitrophenoxy)ethanoylamino]pyrazol-1-yl]ethanoate::ethyl 2-[3,5-dimethyl-4-[[2-(4-nitrophenoxy)acetyl]amino]pyrazol-1-yl]acetate
SMILES CCOC(=O)Cn1nc(C)c(NC(=O)COc2ccc(cc2)[N+]([O-])=O)c1C
InChI Key InChIKey=VSOCXLHHIKMUDG-UHFFFAOYSA-N
Data  1 EC50
  Tab Delimited (TSV)   2D SDfile   Computed 3D by Vconf -m prep SDfile
Find this compound or compounds like it in BindingDB:
Activity Spreadsheet -- Enzyme Inhibition Constant Data from BindingDB
Found 1 hit for monomerid = 63428
TargetHeat shock factor protein 1(Mus musculus)
Broad Institute
Curated by PubChem BioAssay
LigandPNGBDBM63428(2-[3,5-dimethyl-4-[[2-(4-nitrophenoxy)-1-oxoethyl]...)
Affinity DataEC50: >1.95E+5nM. Assay description: Keywords: Heat Shock Factor-1 (HSF-1), Stress Response, MG132, NIH3T3, Luminescence Assay Overview: Modified NIH3T3, transformed to express firefly...
In DepthDetails PCBioAssay