BDBM63491 4-[[3-(2-hydroxyethyl)-4-(2-phenylethyl)-1-piperazinyl]methyl]benzoic acid methyl ester::4-[[3-(2-hydroxyethyl)-4-phenethyl-piperazino]methyl]benzoic acid methyl ester::MLS000732872::SMR000316123::cid_16190140::methyl 4-[[3-(2-hydroxyethyl)-4-(2-phenylethyl)piperazin-1-yl]methyl]benzoate::methyl 4-{[3-(2-hydroxyethyl)-4-(2-phenylethyl)piperazin-1-yl]methyl}benzoate
SMILES COC(=O)c1ccc(CN2CCN(CCc3ccccc3)C(CCO)C2)cc1
InChI Key InChIKey=HUTXIKDFPYKCCC-UHFFFAOYSA-N
Data  1 EC50
  Tab Delimited (TSV)   2D SDfile   Computed 3D by Vconf -m prep SDfile
Find this compound or compounds like it in BindingDB:
Activity Spreadsheet -- Enzyme Inhibition Constant Data from BindingDB
Found 1 hit for monomerid = 63491
TargetHeat shock factor protein 1(Mus musculus)
Broad Institute
Curated by PubChem BioAssay
LigandPNGBDBM63491(4-[[3-(2-hydroxyethyl)-4-(2-phenylethyl)-1-piperaz...)
Affinity DataEC50: >1.95E+5nM. Assay description: Keywords: Heat Shock Factor-1 (HSF-1), Stress Response, MG132, NIH3T3, Luminescence Assay Overview: Modified NIH3T3, transformed to express firefly...
In DepthDetails PCBioAssay