BDBM63494 2-[1-(phenylmethyl)-4-[(3-pyrazol-1-ylphenyl)methyl]piperazin-2-yl]ethanol::2-[1-(phenylmethyl)-4-[[3-(1-pyrazolyl)phenyl]methyl]-2-piperazinyl]ethanol::2-[1-benzyl-4-(3-pyrazol-1-ylbenzyl)piperazin-2-yl]ethanol::2-[1-benzyl-4-[(3-pyrazol-1-ylphenyl)methyl]piperazin-2-yl]ethanol::2-{1-benzyl-4-[3-(1H-pyrazol-1-yl)benzyl]piperazin-2-yl}ethanol::MLS000733157::SMR000315181::cid_16190658
SMILES OCCC1CN(Cc2cccc(c2)-n2cccn2)CCN1Cc1ccccc1
InChI Key InChIKey=CBEJDQANZKCNQB-UHFFFAOYSA-N
Data  1 EC50
  Tab Delimited (TSV)   2D SDfile   Computed 3D by Vconf -m prep SDfile
Find this compound or compounds like it in BindingDB:
Activity Spreadsheet -- Enzyme Inhibition Constant Data from BindingDB
Found 1 hit for monomerid = 63494
TargetHeat shock factor protein 1(Mus musculus)
Broad Institute
Curated by PubChem BioAssay
LigandPNGBDBM63494(2-[1-(phenylmethyl)-4-[(3-pyrazol-1-ylphenyl)methy...)
Affinity DataEC50: >1.95E+5nM. Assay description: Keywords: Heat Shock Factor-1 (HSF-1), Stress Response, MG132, NIH3T3, Luminescence Assay Overview: Modified NIH3T3, transformed to express firefly...
In DepthDetails PCBioAssay