BDBM63515 3-(4-methoxyphenyl)-1,1-bis(oxidanylidene)-2,3-dihydro-1,2,5-thiadiazol-4-amine::3-(4-methoxyphenyl)-1,1-dioxo-2,3-dihydro-1,2,5-thiadiazol-4-amine::4-(4-methoxyphenyl)-1,2,5-thiadiazolidin-3-imine 1,1-dioxide::MLS000676680::SMR000298332::[1,1-diketo-3-(4-methoxyphenyl)-2,3-dihydro-1,2,5-thiadiazol-4-yl]amine::cid_2892852
SMILES COc1ccc(cc1)C1NS(=O)(=O)N=C1N
InChI Key InChIKey=UOTYWJUVELGPDX-UHFFFAOYSA-N
Data  1 EC50
  Tab Delimited (TSV)   2D SDfile   Computed 3D by Vconf -m prep SDfile
Find this compound or compounds like it in BindingDB:
Activity Spreadsheet -- Enzyme Inhibition Constant Data from BindingDB
Found 1 hit for monomerid = 63515
TargetHeat shock factor protein 1(Mus musculus)
Broad Institute
Curated by PubChem BioAssay
LigandPNGBDBM63515(3-(4-methoxyphenyl)-1,1-bis(oxidanylidene)-2,3-dih...)
Affinity DataEC50: >1.95E+5nM. Assay description: Keywords: Heat Shock Factor-1 (HSF-1), Stress Response, MG132, NIH3T3, Luminescence Assay Overview: Modified NIH3T3, transformed to express firefly...
In DepthDetails PCBioAssay