BDBM63570 2-[cyclohexyl(methyl)amino]-10-pyridazino[6,1-b]quinazolinone::2-[cyclohexyl(methyl)amino]-10H-pyridazino[6,1-b]quinazolin-10-one::2-[cyclohexyl(methyl)amino]pyridazino[6,1-b]quinazolin-10-one::MLS000660700::SMR000310219::cid_6618865
SMILES CN(C1CCCCC1)c1ccc2nc3ccccc3c(=O)n2n1
InChI Key InChIKey=OKMJJJISENEROA-UHFFFAOYSA-N
Data  1 EC50
  Tab Delimited (TSV)   2D SDfile   Computed 3D by Vconf -m prep SDfile
Find this compound or compounds like it in BindingDB:
Activity Spreadsheet -- Enzyme Inhibition Constant Data from BindingDB
Found 1 hit for monomerid = 63570
TargetHeat shock factor protein 1(Mus musculus)
Broad Institute
Curated by PubChem BioAssay
LigandPNGBDBM63570(2-[cyclohexyl(methyl)amino]-10-pyridazino[6,1-b]qu...)
Affinity DataEC50: <160nM. Assay description: Keywords: Heat Shock Factor-1 (HSF-1), Stress Response, MG132, NIH3T3, Luminescence Assay Overview: Modified NIH3T3, transformed to express firefly...
Ligand InfoPC cidPC sid
In DepthDetails PCBioAssay