BDBM63635 2-[5-(4-chlorobenzoyl)-2-thienyl]acetamide::2-[5-(4-chlorobenzoyl)thiophen-2-yl]acetamide::2-[5-(4-chlorophenyl)carbonylthiophen-2-yl]ethanamide::2-[5-[(4-chlorophenyl)-oxomethyl]-2-thiophenyl]acetamide::MLS000720904::SMR000334244::cid_1486758
SMILES NC(=O)Cc1ccc(s1)C(=O)c1ccc(Cl)cc1
InChI Key InChIKey=KWXLJKBBACCJRI-UHFFFAOYSA-N
Data  1 EC50
  Tab Delimited (TSV)   2D SDfile   Computed 3D by Vconf -m prep SDfile
Find this compound or compounds like it in BindingDB:
Activity Spreadsheet -- Enzyme Inhibition Constant Data from BindingDB
Found 1 hit for monomerid = 63635
TargetHeat shock factor protein 1(Mus musculus)
Broad Institute
Curated by PubChem BioAssay
LigandPNGBDBM63635(2-[5-(4-chlorobenzoyl)-2-thienyl]acetamide | 2-[5-...)
Affinity DataEC50: >1.95E+5nM. Assay description: Keywords: Heat Shock Factor-1 (HSF-1), Stress Response, MG132, NIH3T3, Luminescence Assay Overview: Modified NIH3T3, transformed to express firefly...
In DepthDetails PCBioAssay