BDBM6376 8-Cyclopentyl-2-[4-(3,3-dimethyl-piperazin-1-yl)-phenylamino]-5-methyl-8H-pyrido[2,3-d]pyrimidin-7-one::8-cyclopentyl-2-{[4-(3,3-dimethylpiperazin-1-yl)phenyl]amino}-5-methyl-7H,8H-pyrido[2,3-d]pyrimidin-7-one::pyrido[2,3-d]pyrimidin-7-one 23
SMILES Cc1cc(=O)n(C2CCCC2)c2nc(Nc3ccc(cc3)N3CCNC(C)(C)C3)ncc12
InChI Key InChIKey=KQCSRBKMYHPKNE-UHFFFAOYSA-N
Data  4 IC50
  Tab Delimited (TSV)   2D SDfile   Computed 3D by Vconf -m prep SDfile
Find this compound or compounds like it in BindingDB:
Activity Spreadsheet -- Enzyme Inhibition Constant Data from BindingDB
Found 4 hits for monomerid = 6376
LigandPNGBDBM6376(8-Cyclopentyl-2-[4-(3,3-dimethyl-piperazin-1-yl)-p...)
Affinity DataIC50:  65nM. Assay description: The enzyme was assayed with substrate GST- retinoblastoma in the presence of 25 uM ATP/[gamma-32P] ATP. IC50 is the inhibitor concentration, which in...
In DepthDetails ArticlePubMed
TargetCyclin-dependent kinase 2/G1/S-specific cyclin-E1(Homo sapiens (Human))
Pfizer
LigandPNGBDBM6376(8-Cyclopentyl-2-[4-(3,3-dimethyl-piperazin-1-yl)-p...)
Affinity DataIC50: >5.00E+3nM. Assay description: The enzyme was assayed with substrate GST- retinoblastoma in the presence of 12 uM ATP/[gamma-32P] ATP. IC50 is the inhibitor concentration, which in...
In DepthDetails ArticlePubMed
TargetCyclin-A2/Cyclin-dependent kinase 2(Homo sapiens (Human))
Pfizer
LigandPNGBDBM6376(8-Cyclopentyl-2-[4-(3,3-dimethyl-piperazin-1-yl)-p...)
Affinity DataIC50: >5.00E+3nM. Assay description: The enzyme was assayed with substrate GST- retinoblastoma in the presence of 12 uM ATP/[gamma-32P] ATP. IC50 is the inhibitor concentration, which in...
In DepthDetails ArticlePubMed
LigandPNGBDBM6376(8-Cyclopentyl-2-[4-(3,3-dimethyl-piperazin-1-yl)-p...)
Affinity DataIC50: >5.00E+3nM. Assay description: The enzyme was assayed with substrate GST- retinoblastoma in the presence of 12 uM ATP/[gamma-32P] ATP. IC50 is the inhibitor concentration, which in...
In DepthDetails ArticlePubMed