BDBM64064 2-[(3S)-2-tert-butyl-1,1-bis(oxidanylidene)-5-(trifluoromethyl)-3H-1,2-benzothiazol-3-yl]ethanoic acid::2-[(3S)-2-tert-butyl-1,1-diketo-5-(trifluoromethyl)-3H-1,2-benzothiazol-3-yl]acetic acid::2-[(3S)-2-tert-butyl-1,1-dioxo-5-(trifluoromethyl)-3H-1,2-benzothiazol-3-yl]acetic acid::MLS000881643::SMR000525281::cid_24747557
SMILES CC(C)(C)N1[C@@H](CC(O)=O)c2cc(ccc2S1(=O)=O)C(F)(F)F
InChI Key InChIKey=YTCVDWYDLWAIOJ-JTQLQIEISA-N
Data  1 EC50
  Tab Delimited (TSV)   2D SDfile   Computed 3D by Vconf -m prep SDfile
Find this compound or compounds like it in BindingDB:
Activity Spreadsheet -- Enzyme Inhibition Constant Data from BindingDB
Found 1 hit for monomerid = 64064
TargetHeat shock factor protein 1(Mus musculus)
Broad Institute
Curated by PubChem BioAssay
LigandPNGBDBM64064(2-[(3S)-2-tert-butyl-1,1-bis(oxidanylidene)-5-(tri...)
Affinity DataEC50: >1.95E+5nM. Assay description: Keywords: Heat Shock Factor-1 (HSF-1), Stress Response, MG132, NIH3T3, Luminescence Assay Overview: Modified NIH3T3, transformed to express firefly...
In DepthDetails PCBioAssay