BDBM64071 1-(4-amino-1,2,5-oxadiazol-3-yl)-5-propan-2-yl-N-(1-pyridin-4-ylethylideneamino)-4-triazolecarboxamide::1-(4-amino-1,2,5-oxadiazol-3-yl)-5-propan-2-yl-N-(1-pyridin-4-ylethylideneamino)triazole-4-carboxamide::1-(4-aminofurazan-3-yl)-5-isopropyl-N-[1-(4-pyridyl)ethylideneamino]triazole-4-carboxamide::1-(4-azanyl-1,2,5-oxadiazol-3-yl)-5-propan-2-yl-N-(1-pyridin-4-ylethylideneamino)-1,2,3-triazole-4-carboxamide::MLS001213354::SMR000540643::cid_3726767
SMILES CC(C)c1c(nnn1-c1nonc1N)C(=O)NN=C(C)c1ccncc1
InChI Key InChIKey=AXXKSUFRPSDZDO-UHFFFAOYSA-N
Data  1 EC50
  Tab Delimited (TSV)   2D SDfile   Computed 3D by Vconf -m prep SDfile
Find this compound or compounds like it in BindingDB:
Activity Spreadsheet -- Enzyme Inhibition Constant Data from BindingDB
Found 1 hit for monomerid = 64071
TargetHeat shock factor protein 1(Mus musculus)
Broad Institute
Curated by PubChem BioAssay
LigandPNGBDBM64071(1-(4-amino-1,2,5-oxadiazol-3-yl)-5-propan-2-yl-N-(...)
Affinity DataEC50: >1.95E+5nM. Assay description: Keywords: Heat Shock Factor-1 (HSF-1), Stress Response, MG132, NIH3T3, Luminescence Assay Overview: Modified NIH3T3, transformed to express firefly...
In DepthDetails PCBioAssay