BDBM64553 US9428505, Compound 2
SMILES Cc1cc(cc(C)c1CCS(=O)(=O)N1CCC2(CC1)N=C(NC2=O)c1cccc(Br)c1)N1C(=O)NC(=O)C1(C)C
InChI Key InChIKey=STUYIOKFRHRZHA-UHFFFAOYSA-N
Data  1 EC50
  Tab Delimited (TSV)   2D SDfile   Computed 3D by Vconf -m prep SDfile
Find this compound or compounds like it in BindingDB:
Activity Spreadsheet -- Enzyme Inhibition Constant Data from BindingDB
Found 1 hit for monomerid = 64553
TargetParathyroid hormone [32-65](Homo sapiens (Human))
Chugai Seiyaku Kabushiki Kaisha
US Patent
LigandPNGBDBM64553(US9428505, Compound 2)
Affinity DataEC50:  1.40E+4nMpH: 7.4Assay Description:HKRK-B7 or LLC-PK1 cells were seeded into a 96-well plate at 1×105 cells/well and incubated overnight. On the following day, 50 μl of cAMP assay...
In DepthDetails US Patent