BDBM6475 4-Anilino-7,8-dialkoxybenzo[g]quinoline-3-carbonitrile 17g::4-[(2-chloro-5-methoxy-4-methylphenyl)amino]-8-[2-(4-hydroxypiperidin-1-yl)ethoxy]-7-methoxybenzo[g]quinoline-3-carbonitrile
SMILES COc1cc(Nc2c(cnc3cc4cc(OCCN5CCC(O)CC5)c(OC)cc4cc23)C#N)c(Cl)cc1C
InChI Key InChIKey=RPEJFDATCICOSJ-UHFFFAOYSA-N
Data  1 IC50
  Tab Delimited (TSV)   2D SDfile   Computed 3D by Vconf -m prep SDfile
Find this compound or compounds like it in BindingDB:
Activity Spreadsheet -- Enzyme Inhibition Constant Data from BindingDB
Found 1 hit for monomerid = 6475
TargetProto-oncogene tyrosine-protein kinase Src(Homo sapiens (Human))
Wyeth Research
LigandPNGBDBM6475(4-Anilino-7,8-dialkoxybenzo[g]quinoline-3-carbonit...)
Affinity DataIC50:  0.550nMpH: 7.5 T: 2°C. Assay description: Src kinase activity was measured in an ELISA format. IC50 is the inhibitor concentration which inhibits 50% of kinase activity that catalyzes the tra...
In DepthDetails ArticlePubMed