BDBM650 (2R,4S)-2-[(R)-(benzylcarbamoyl)(1-phenylacetamido)methyl]-5,5-dimethyl-N-[(2R)-1-phenylpropan-2-yl]-1,3-thiazolidine-4-carboxamide::penicillin deriv. 63
SMILES [H][C@]1(N[C@@H](C(=O)N[C@H](C)Cc2ccccc2)C(C)(C)S1)[C@H](NC(=O)Cc1ccccc1)C(=O)NCc1ccccc1
InChI Key InChIKey=QTNAAUNGPVSOQG-JZJGJFRJSA-N
Data  1 IC50
  Tab Delimited (TSV)   2D SDfile   Computed 3D by Vconf -m prep SDfile
Find this compound or compounds like it in BindingDB:
Activity Spreadsheet -- Enzyme Inhibition Constant Data from BindingDB
Found 1 hit for monomerid = 650
TargetDimer of Gag-Pol polyprotein [489-587](Human immunodeficiency virus type 1)
Glaxo Group Research
LigandPNGBDBM650((2R,4S)-2-[(R)-(benzylcarbamoyl)(1-phenylacetamido...)
Affinity DataIC50: >1.80E+5nMpH: 6.0 T: 2°C. Assay description: IC50 values were obtained by assaying the enzyme against the synthetic substrate peptide KQGTVSFNFPQIT, which was tritiated at the proline residue, a...
In DepthDetails ArticlePubMed