BDBM65006 US8486940, 209
SMILES O=C1OC[C@@H](N1c1ccc2[nH]cnc2c1)c1ccc(cc1)-c1ccccc1
InChI Key
Data  1 IC50
  Tab Delimited (TSV)   2D SDfile   Computed 3D by Vconf -m prep SDfile
Find this compound or compounds like it in BindingDB:
Activity Spreadsheet -- Enzyme Inhibition Constant Data from BindingDB
Found 1 hit for monomerid = 65006
TargetGlutaminyl-peptide cyclotransferase(Homo sapiens (Human))
Probiodrug
US Patent
LigandPNGBDBM65006(US8486940, 209)
Affinity DataIC50: <1.00E+4nM. Assay description: Spectrophotometic Assay: This novel assay was used to determine the kinetic parameters for most of the QC substrates. QC activity was analyzed spect...
In DepthDetails US Patent