BDBM65111 (4E)-5-methyl-2-phenyl-4-[[(5-phenyl-1,2,4-triazin-3-yl)hydrazo]methylidene]-3-pyrazolone::(4E)-5-methyl-2-phenyl-4-[[2-(5-phenyl-1,2,4-triazin-3-yl)hydrazinyl]methylidene]pyrazol-3-one::(4E)-5-methyl-2-phenyl-4-[[N'-(5-phenyl-1,2,4-triazin-3-yl)hydrazino]methylene]-2-pyrazolin-3-one::5-hydroxy-3-methyl-1-phenyl-1H-pyrazole-4-carbaldehyde (5-phenyl-1,2,4-triazin-3-yl)hydrazone::MLS000579075::SMR000186664::cid_5335769
SMILES Cc1[nH]n(-c2ccccc2)c(=O)c1CN=Nc1nncc(n1)-c1ccccc1
InChI Key InChIKey=GXGZJFNYXXENSC-DARPEHSRSA-N
Data  3 IC50  2 EC50
  Tab Delimited (TSV)   2D SDfile   Computed 3D by Vconf -m prep SDfile
Find this compound or compounds like it in BindingDB:
Activity Spreadsheet -- Enzyme Inhibition Constant Data from BindingDB
Found 5 hits for monomerid = 65111
TargetHexokinase HKDC1 [W721R](Homo sapiens (Human))
Burnham Center For Chemical Genomics
Curated by PubChem BioAssay
LigandPNGBDBM65111((4E)-5-methyl-2-phenyl-4-[[(5-phenyl-1,2,4-triazin...)
Affinity DataEC50:  6.69E+3nM. Assay description: Data Source: Sanford-Burnham Center for Chemical Genomics (SBCCG) Source Affiliation: Sanford-Burnham Medical Research Institute (SBMRI, San Diego, C...
Ligand InfoPC cidPC sid
In DepthDetails PCBioAssay
TargetHexokinase-1(Homo sapiens (Human))
Burnham Center For Chemical Genomics
Curated by PubChem BioAssay
LigandPNGBDBM65111((4E)-5-methyl-2-phenyl-4-[[(5-phenyl-1,2,4-triazin...)
Affinity DataEC50: >8.00E+4nM. Assay description: Data Source: Sanford-Burnham Center for Chemical Genomics (SBCCG) Source Affiliation: Sanford-Burnham Medical Research Institute (SBMRI, San Diego, C...
Ligand InfoPC cidPC sid
In DepthDetails PCBioAssay
TargetCaspase-9(Homo sapiens (Human))
Burnham Center For Chemical Genomics
Curated by PubChem BioAssay
LigandPNGBDBM65111((4E)-5-methyl-2-phenyl-4-[[(5-phenyl-1,2,4-triazin...)
Affinity DataIC50:  2.23E+3nM. Assay description: Data Source: Sanford-Burnham Center for Chemical Genomics (SBCCG) Source Affiliation: Sanford-Burnham Medical Research Institute (SBIMR, San Diego, C...
Ligand InfoPC cidPC sid
In DepthDetails PCBioAssay
TargetApoptotic protease-activating factor 1(Homo sapiens (Human))
Burnham Center For Chemical Genomics
Curated by PubChem BioAssay
LigandPNGBDBM65111((4E)-5-methyl-2-phenyl-4-[[(5-phenyl-1,2,4-triazin...)
Affinity DataIC50: >1.00E+5nM. Assay description: Data Source: Sanford-Burnham Center for Chemical Genomics (SBCCG) Source Affiliation: Sanford-Burnham Medical Research Institute (SBIMR, San Diego, C...
Ligand InfoPC cidPC sid
In DepthDetails PCBioAssay
TargetApoptotic protease-activating factor 1(Homo sapiens (Human))
Burnham Center For Chemical Genomics
Curated by PubChem BioAssay
LigandPNGBDBM65111((4E)-5-methyl-2-phenyl-4-[[(5-phenyl-1,2,4-triazin...)
Affinity DataIC50:  3.50E+3nM. Assay description: Data Source: Sanford-Burnham Center for Chemical Genomics (SBCCG) Source Affiliation: Sanford-Burnham Medical Research Institute (SBIMR, San Diego, C...
Ligand InfoPC cidPC sid
In DepthDetails PCBioAssay