BDBM6520 4-[(2,4-dichloro-5-methoxyphenyl)amino]-7-[2-(pyridin-3-yl)ethynyl]quinoline-3-carbonitrile::ethynyl-4-phenylamino-3-quinolinecarbonitrile 3b
SMILES COc1cc(Nc2c(cnc3cc(ccc23)C#Cc2cccnc2)C#N)c(Cl)cc1Cl
InChI Key InChIKey=SQKNEXBFHCJKNY-UHFFFAOYSA-N
Data  1 IC50
  Tab Delimited (TSV)   2D SDfile   Computed 3D by Vconf -m prep SDfile
Find this compound or compounds like it in BindingDB:
Activity Spreadsheet -- Enzyme Inhibition Constant Data from BindingDB
Found 1 hit for monomerid = 6520
TargetProto-oncogene tyrosine-protein kinase Src(Homo sapiens (Human))
Wyeth-Ayerst Research
LigandPNGBDBM6520(4-[(2,4-dichloro-5-methoxyphenyl)amino]-7-[2-(pyri...)
Affinity DataIC50:  47nMpH: 7.5 T: 2°C. Assay description: Kinase assays were performed using the europium/APC detection format (LANCE, Perkin Elmer). HTRF is based on the proximity of europium cryptate (dono...
In DepthDetails ArticlePubMed