BDBM65200 US10166249, Example 541::US9522888, 541
SMILES CCOCC[C@@H]1CCc2cc(ccc2C1)[C@H]1CC[C@](N)(COP(O)(O)=O)C1
InChI Key InChIKey=COPVQWREUUTRMK-RYGJVYDSSA-N
Data  2 IC50  6 EC50
  Tab Delimited (TSV)   2D SDfile   Computed 3D by Vconf -m prep SDfile
Find this compound or compounds like it in BindingDB:
Activity Spreadsheet -- Enzyme Inhibition Constant Data from BindingDB
Found 8 hits for monomerid = 65200
TargetSphingosine 1-phosphate receptor 1(Homo sapiens (Human))
Bristol-Myers Squibb
US Patent
LigandPNGBDBM65200(US10166249, Example 541 | US9522888, 541)
Affinity DataIC50: <10nMpH: 7.5 T: 2°C. Assay description: Membranes were prepared from CHO cells expressing human S1P1. Cells pellets (1x10^9 cells/pellet) were suspended in buffer containing 20 mM HEPES (4-...
In DepthDetails US Patent
TargetSphingosine 1-phosphate receptor 1(Homo sapiens (Human))
Bristol-Myers Squibb
US Patent
LigandPNGBDBM65200(US10166249, Example 541 | US9522888, 541)
Affinity DataEC50:  55nMT: 2°C. Assay description: Compounds were loaded in a 384 Falcon v-bottom plate (0.5 ul/well in a 11 point, 3-fold dilution). Membranes prepared from S1P1/CHO cells or EDG3-Gal...
In DepthDetails US Patent
TargetSphingosine 1-phosphate receptor 1(Homo sapiens (Human))
Bristol-Myers Squibb
US Patent
LigandPNGBDBM65200(US10166249, Example 541 | US9522888, 541)
Affinity DataEC50: <10nMT: 2°C. Assay description: hS1P1/CHO cells were plated into BD Amine 384-well plates the day before the assay. On the day of the assay, growth medium was removed and replaced w...
In DepthDetails US Patent
TargetSphingosine 1-phosphate receptor 3(Homo sapiens (Human))
Bristol-Myers Squibb
US Patent
LigandPNGBDBM65200(US10166249, Example 541 | US9522888, 541)
Affinity DataEC50: >625nM. Assay description: Compounds were loaded in a 384 Falcon v-bottom plate (0.5 l/well in a 11 point, 3-fold dilution). Membranes prepared from S1P1/CHO cells or EDG3-Gal5...
In DepthDetails US Patent
TargetSphingosine-1-phosphate lyase 1(Homo sapiens (Human))
Bristol-Myers Squibb
US Patent
LigandPNGBDBM65200(US10166249, Example 541 | US9522888, 541)
Affinity DataIC50: <10nM. Assay description: Membranes were prepared from CHO cells expressing human S1P1. Cells pellets (1×109 cells/pellet) were suspended in buffer containing 20 mM HEPES (4-(...
In DepthDetails US Patent
TargetSphingosine-1-phosphate lyase 1(Homo sapiens (Human))
Bristol-Myers Squibb
US Patent
LigandPNGBDBM65200(US10166249, Example 541 | US9522888, 541)
Affinity DataEC50:  55nM. Assay description: Compounds were loaded in a 384 Falcon v-bottom plate (0.5 l/well in a 11 point, 3-fold dilution). Membranes prepared from S1P1/CHO cells or EDG3-Gal5...
In DepthDetails US Patent
TargetSphingosine-1-phosphate lyase 1(Homo sapiens (Human))
Bristol-Myers Squibb
US Patent
LigandPNGBDBM65200(US10166249, Example 541 | US9522888, 541)
Affinity DataEC50: <10nM. Assay description: hS1P1/CHO cells were plated into BD Amine 384-well plates the day before the assay. On the day of the assay, growth medium was removed and replaced w...
In DepthDetails US Patent
TargetSphingosine 1-phosphate receptor 3(Homo sapiens (Human))
Bristol-Myers Squibb
US Patent
LigandPNGBDBM65200(US10166249, Example 541 | US9522888, 541)
Affinity DataEC50: >625nMT: 2°C. Assay description: Compounds were loaded in a 384 Falcon v-bottom plate (0.5 ul/well in a 11 point, 3-fold dilution). Membranes prepared from S1P1/CHO cells or EDG3-Gal...
In DepthDetails US Patent