BDBM65551 Synthesized Sulfanylacrylonitril Derivatives 3
SMILES CS\C(Nc1ccccc1)=C(\C#N)S(=O)(=O)c1ccccc1
InChI Key InChIKey=YGJCIUAYCHMPBU-NXVVXOECSA-N
Data  1 IC50
  Tab Delimited (TSV)   2D SDfile   Computed 3D by Vconf -m prep SDfile
Find this compound or compounds like it in BindingDB:
Activity Spreadsheet -- Enzyme Inhibition Constant Data from BindingDB
Found 1 hit for monomerid = 65551
TargetAP-4-A phosphorylase(Mycobacterium tuberculosis (strain ATCC 25618 / H3...)
University Of Konstanz
LigandPNGBDBM65551(Synthesized Sulfanylacrylonitril Derivatives 3)
Affinity DataIC50: >3.00E+4nMpH: 8.0Assay Description:Dose response curves against Rv2613c with 1 as the substrate for derivatives 5 and 18. 8 nM of Rv2613c were preincubated in buffer (20 mM Tris-HCl (p...
In DepthDetails ArticlePubMed