BDBM65837 4-(4,5-diphenyl-1,3-dihydroimidazol-2-ylidene)-2-methoxy-1-cyclohexa-2,5-dienone::4-(4,5-diphenyl-1,3-dihydroimidazol-2-ylidene)-2-methoxy-cyclohexa-2,5-dien-1-one::4-(4,5-diphenyl-1,3-dihydroimidazol-2-ylidene)-2-methoxycyclohexa-2,5-dien-1-one::4-(4,5-diphenyl-4-imidazolin-2-ylidene)-2-methoxy-cyclohexa-2,5-dien-1-one::SR-01000442018-2::cid_5337430
SMILES COc1cc(ccc1O)-c1nc(c([nH]1)-c1ccccc1)-c1ccccc1
InChI Key InChIKey=GVVMEVSFLBMIMJ-UHFFFAOYSA-N
Data  5 IC50
  Tab Delimited (TSV)   2D SDfile   Computed 3D by Vconf -m prep SDfile
Find this compound or compounds like it in BindingDB:
Activity Spreadsheet -- Enzyme Inhibition Constant Data from BindingDB
Found 5 hits for monomerid = 65837
TargetNADPH oxidase 1(Homo sapiens (Human))
The Scripps Research Institute Molecular Screening Center
Curated by PubChem BioAssay
LigandPNGBDBM65837(4-(4,5-diphenyl-1,3-dihydroimidazol-2-ylidene)-2-m...)
Affinity DataIC50:  1.81E+3nM. Assay description: Data Source (MLPCN Center Name): The Scripps Research Institute Molecular Screening Center (SRIMSC) Center Affiliation: The Scripps Research Institut...
In DepthDetails PCBioAssay
TargetNADPH oxidase 1(Homo sapiens (Human))
The Scripps Research Institute Molecular Screening Center
Curated by PubChem BioAssay
LigandPNGBDBM65837(4-(4,5-diphenyl-1,3-dihydroimidazol-2-ylidene)-2-m...)
Affinity DataIC50:  1.12E+4nM. Assay description: Data Source (MLPCN Center Name): The Scripps Research Institute Molecular Screening Center (SRIMSC) Center Affiliation: The Scripps Research Institut...
In DepthDetails PCBioAssay
TargetNADPH oxidase 1(Homo sapiens (Human))
The Scripps Research Institute Molecular Screening Center
Curated by PubChem BioAssay
LigandPNGBDBM65837(4-(4,5-diphenyl-1,3-dihydroimidazol-2-ylidene)-2-m...)
Affinity DataIC50:  10nM. Assay description: Data Source (MLPCN Center Name): The Scripps Research Institute Molecular Screening Center (SRIMSC) Center Affiliation: The Scripps Research Institut...
In DepthDetails PCBioAssay
TargetNADPH oxidase 1(Homo sapiens (Human))
The Scripps Research Institute Molecular Screening Center
Curated by PubChem BioAssay
LigandPNGBDBM65837(4-(4,5-diphenyl-1,3-dihydroimidazol-2-ylidene)-2-m...)
Affinity DataIC50:  370nM. Assay description: Data Source (MLPCN Center Name): The Scripps Research Institute Molecular Screening Center (SRIMSC) Center Affiliation: The Scripps Research Institut...
In DepthDetails PCBioAssay
TargetNADPH oxidase 1(Homo sapiens (Human))
The Scripps Research Institute Molecular Screening Center
Curated by PubChem BioAssay
LigandPNGBDBM65837(4-(4,5-diphenyl-1,3-dihydroimidazol-2-ylidene)-2-m...)
Affinity DataIC50:  1.81E+3nM. Assay description: Data Source (MLPCN Center Name): The Scripps Research Institute Molecular Screening Center (SRIMSC) Center Affiliation: The Scripps Research Institut...
In DepthDetails PCBioAssay