BDBM65900 5-chloranyl-2-[(2-fluorophenyl)methylsulfonyl]-N-(5-propan-2-yl-1,3,4-thiadiazol-2-yl)pyrimidine-4-carboxamide::5-chloro-2-(2-fluorobenzyl)sulfonyl-N-(5-isopropyl-1,3,4-thiadiazol-2-yl)pyrimidine-4-carboxamide::5-chloro-2-[(2-fluorophenyl)methylsulfonyl]-N-(5-propan-2-yl-1,3,4-thiadiazol-2-yl)-4-pyrimidinecarboxamide::5-chloro-2-[(2-fluorophenyl)methylsulfonyl]-N-(5-propan-2-yl-1,3,4-thiadiazol-2-yl)pyrimidine-4-carboxamide::MLS001116187::SMR000625783::cid_16446302
SMILES CC(C)c1nnc(NC(=O)c2nc(ncc2Cl)S(=O)(=O)Cc2ccccc2F)s1
InChI Key InChIKey=RTGUMSVPNPAQGK-UHFFFAOYSA-N
Data  1 EC50
  Tab Delimited (TSV)   2D SDfile   Computed 3D by Vconf -m prep SDfile
Find this compound or compounds like it in BindingDB:
Activity Spreadsheet -- Enzyme Inhibition Constant Data from BindingDB
Found 1 hit for monomerid = 65900
TargetPotassium voltage-gated channel subfamily KQT member 2(Rattus norvegicus)
Johns Hopkins Ion Channel Center
Curated by PubChem BioAssay
LigandPNGBDBM65900(5-chloranyl-2-[(2-fluorophenyl)methylsulfonyl]-N-(...)
Affinity DataEC50:  8.40E+3nM. Assay description: BioAssay Type: Confirmatory, Concentration-Response Relationship Observed Source (MLPCN Center Name): Johns Hopkins Ion Channel Center (JHICC) Center...
In DepthDetails PCBioAssay