BDBM65915 N-(5-methyl-1,2-oxazol-3-yl)-2-[1-[[3-(1-methylpyrazol-3-yl)phenyl]methyl]indol-3-yl]sulfonyl-ethanamide::N-(5-methyl-1,2-oxazol-3-yl)-2-[1-[[3-(1-methylpyrazol-3-yl)phenyl]methyl]indol-3-yl]sulfonylacetamide::N-(5-methyl-3-isoxazolyl)-2-[[1-[[3-(1-methyl-3-pyrazolyl)phenyl]methyl]-3-indolyl]sulfonyl]acetamide::N-(5-methylisoxazol-3-yl)-2-[1-[3-(1-methylpyrazol-3-yl)benzyl]indol-3-yl]sulfonyl-acetamide::VU0402606-1::cid_44247544
SMILES Cc1cc(NC(=O)CS(=O)(=O)c2cn(Cc3cccc(c3)-c3ccn(C)n3)c3ccccc23)no1
InChI Key InChIKey=SYUAMNRBIFTHNE-UHFFFAOYSA-N
Data  1 EC50
  Tab Delimited (TSV)   2D SDfile   Computed 3D by Vconf -m prep SDfile
Find this compound or compounds like it in BindingDB:
Activity Spreadsheet -- Enzyme Inhibition Constant Data from BindingDB
Found 1 hit for monomerid = 65915
TargetMuscarinic acetylcholine receptor M1(RAT)
Vanderbilt Screening Center For Gpcrs, Ion Channels And Transporters
Curated by PubChem BioAssay
LigandPNGBDBM65915(N-(5-methyl-1,2-oxazol-3-yl)-2-[1-[[3-(1-methylpyr...)
Affinity DataEC50:  3.21E+3nM. Assay description: Assay Provider: P. Jeffery Conn Assay Provider Affiliation: Vanderbilt University Grant Title: Discovery of novel allosteric modulators of the M1 Mus...
In DepthDetails PCBioAssay