BDBM66068 (3-methyl-3',5'-dinitro-1'-spiro[cyclohepta[d]thiazol-3-ium-2,4'-cyclohexa-2,5-diene]ylidene)-dioxidoammonium::(3-methyl-3',5'-dinitro-spiro[cyclohepta[d][1,3]thiazol-3-ium-2,4'-cyclohexa-2,5-diene]-1'-ylidene)-bis(oxidanidyl)azanium::(3-methyl-3',5'-dinitro-spiro[cyclohepta[d]thiazol-3-ium-2,4'-cyclohexa-2,5-diene]-1'-ylidene)-dioxido-ammonium::(3-methyl-3',5'-dinitrospiro[cyclohepta[d][1,3]thiazol-3-ium-2,4'-cyclohexa-2,5-diene]-1'-ylidene)-dioxidoazanium::MLS001012288::SMR000425123::cid_3746037
SMILES [#6]-[#7]1-[c+]2cccccc2-[#16]C11[#6](=[#6]\[#6](-[#6]=[#6]1-[#7+](-[#8-])=O)=[#7+](\[#8-])-[#8-])-[#7+](-[#8-])=O
InChI Key InChIKey=ZJFOXBNOYKAJHK-UHFFFAOYSA-N
Data  1 EC50
  Tab Delimited (TSV)   2D SDfile   Computed 3D by Vconf -m prep SDfile
Find this compound or compounds like it in BindingDB:
Activity Spreadsheet -- Enzyme Inhibition Constant Data from BindingDB
Found 1 hit for monomerid = 66068
TargetVacuolar aminopeptidase 1(Saccharomyces cerevisiae)
Nmmlsc
Curated by PubChem BioAssay
LigandPNGBDBM66068((3-methyl-3',5'-dinitro-1'-spiro[cyclohepta[d]thia...)
Affinity DataEC50:  6.27E+3nM. Assay description: University of New Mexico Assay Overview: Assay Support: 1R03 MH086450-01 Project Title: Chemical Screen of TOR pathway GFP fusion proteins in S. ...
Ligand InfoPC cidPC sid
In DepthDetails PCBioAssay