BDBM66199 (4Z)-4-[1,3-benzodioxol-5-yl(hydroxy)methylene]-5-(3-chlorophenyl)-1-(2-morpholinoethyl)pyrrolidine-2,3-quinone::(4Z)-4-[1,3-benzodioxol-5-yl(hydroxy)methylidene]-5-(3-chlorophenyl)-1-(2-morpholin-4-ylethyl)pyrrolidine-2,3-dione::(4Z)-4-[1,3-benzodioxol-5-yl(hydroxy)methylidene]-5-(3-chlorophenyl)-1-[2-(4-morpholinyl)ethyl]pyrrolidine-2,3-dione::(4Z)-4-[1,3-benzodioxol-5-yl(oxidanyl)methylidene]-5-(3-chlorophenyl)-1-(2-morpholin-4-ylethyl)pyrrolidine-2,3-dione::MLS001034301::SMR000666202::cid_6002572
SMILES Clc1cccc(c1)C1C(C(=O)c2ccc3OCOc3c2)C(=O)C(=O)N1CCN1CCOCC1
InChI Key InChIKey=SUBKVTVZAAKWCQ-UHFFFAOYSA-N
Data  2 IC50
  Tab Delimited (TSV)   2D SDfile   Computed 3D by Vconf -m prep SDfile
Find this compound or compounds like it in BindingDB:
Activity Spreadsheet -- Enzyme Inhibition Constant Data from BindingDB
Found 2 hits for monomerid = 66199
TargetIsoform 2 of Nuclear receptor corepressor 2 (TRAC-1)(Homo sapiens (Human))
The Scripps Research Institute Molecular Screening Center
Curated by PubChem BioAssay
LigandPNGBDBM66199((4Z)-4-[1,3-benzodioxol-5-yl(hydroxy)methylene]-5-...)
Affinity DataIC50:  5.91E+3nM. Assay description: Source (MLPCN Center Name): The Scripps Research Institute Molecular Screening Center Affiliation: The Scripps Research Institute, TSRI Assay Provide...
In DepthDetails PCBioAssay
TargetPhotoreceptor-specific nuclear receptor(Homo sapiens (Human))
The Scripps Research Institute Molecular Screening Center
Curated by PubChem BioAssay
LigandPNGBDBM66199((4Z)-4-[1,3-benzodioxol-5-yl(hydroxy)methylene]-5-...)
Affinity DataIC50:  1.24E+4nM. Assay description: Source (MLPCN Center Name): The Scripps Research Institute Molecular Screening Center Affiliation: The Scripps Research Institute, TSRI Assay Provide...
In DepthDetails PCBioAssay