BDBM66720 2-Fluoro-N-[2-(2-fluoro-phenyl)-benzooxazol-5-yl]-benzamide::2-fluoranyl-N-[2-(2-fluorophenyl)-1,3-benzoxazol-5-yl]benzamide::2-fluoro-N-[2-(2-fluorophenyl)-1,3-benzoxazol-5-yl]benzamide::MLS001210982::SMR000513967::cid_2244594
SMILES Fc1ccccc1C(=O)Nc1ccc2oc(nc2c1)-c1ccccc1F
InChI Key InChIKey=KVMZJXZKTAAATN-UHFFFAOYSA-N
Data  1 EC50
  Tab Delimited (TSV)   2D SDfile   Computed 3D by Vconf -m prep SDfile
Find this compound or compounds like it in BindingDB:
Activity Spreadsheet -- Enzyme Inhibition Constant Data from BindingDB
Found 1 hit for monomerid = 66720
TargetBcl-2-like protein 11(Homo sapiens (Human))
Broad Institute
Curated by PubChem BioAssay
LigandPNGBDBM66720(2-Fluoro-N-[2-(2-fluoro-phenyl)-benzooxazol-5-yl]-...)
Affinity DataEC50: >3.50E+5nM. Assay description: Keywords: apoptosis, BH3 domain, Bcl2-A1, BIM, caspase, cancer Primary Collaborator: Todd Golub, Broad Institute, golub@broadinstitute.org Assay Over...
In DepthDetails PCBioAssay