BDBM66971 MLS001138766::N-(3,4-dichlorophenyl)-2-[2-[(3,5-dimethyl-1,2-oxazol-4-yl)methylsulfanyl]ethanoyl-methyl-amino]ethanamide::N-(3,4-dichlorophenyl)-2-[[2-[(3,5-dimethyl-1,2-oxazol-4-yl)methylsulfanyl]acetyl]-methylamino]acetamide::N-(3,4-dichlorophenyl)-2-[[2-[(3,5-dimethyl-4-isoxazolyl)methylthio]-1-oxoethyl]-methylamino]acetamide::N-(3,4-dichlorophenyl)-2-[[2-[(3,5-dimethylisoxazol-4-yl)methylthio]acetyl]-methyl-amino]acetamide::SMR000708143::cid_24982749
SMILES CN(CC(=O)Nc1ccc(Cl)c(Cl)c1)C(=O)CSCc1c(C)noc1C
InChI Key InChIKey=SCHQPWPELTVUAM-UHFFFAOYSA-N
Data  1 EC50
  Tab Delimited (TSV)   2D SDfile   Computed 3D by Vconf -m prep SDfile
Find this compound or compounds like it in BindingDB:
Activity Spreadsheet -- Enzyme Inhibition Constant Data from BindingDB
Found 1 hit for monomerid = 66971
TargetBcl-2-like protein 11(Homo sapiens (Human))
Broad Institute
Curated by PubChem BioAssay
LigandPNGBDBM66971(MLS001138766 | N-(3,4-dichlorophenyl)-2-[2-[(3,5-d...)
Affinity DataEC50: >3.50E+5nM. Assay description: Keywords: apoptosis, BH3 domain, Bcl2-A1, BIM, caspase, cancer Primary Collaborator: Todd Golub, Broad Institute, golub@broadinstitute.org Assay Over...
In DepthDetails PCBioAssay