BDBM67155 1-[2-[(4-methoxy-1,3-benzothiazol-2-yl)amino]-4-methyl-1,3-thiazol-5-yl]ethanone::1-[2-[(4-methoxy-1,3-benzothiazol-2-yl)amino]-4-methyl-5-thiazolyl]ethanone::1-[2-[(4-methoxy-1,3-benzothiazol-2-yl)amino]-4-methyl-thiazol-5-yl]ethanone::1-{2-[(4-methoxy-1,3-benzothiazol-2-yl)amino]-4-methyl-1,3-thiazol-5-yl}ethanone::MLS000045454::SMR000027214::cid_3239204
SMILES COc1cccc2sc(Nc3nc(C)c(s3)C(C)=O)nc12
InChI Key InChIKey=LGSGETCAZSUWQV-UHFFFAOYSA-N
Data  2 IC50
  Tab Delimited (TSV)   2D SDfile   Computed 3D by Vconf -m prep SDfile
Find this compound or compounds like it in BindingDB:
Activity Spreadsheet -- Enzyme Inhibition Constant Data from BindingDB
Found 2 hits for monomerid = 67155
TargetType-1 angiotensin II receptor(Homo sapiens (Human))
Burnham Center For Chemical Genomics
Curated by PubChem BioAssay
LigandPNGBDBM67155(1-[2-[(4-methoxy-1,3-benzothiazol-2-yl)amino]-4-me...)
Affinity DataIC50:  2.33E+4nM. Assay description: Data Source: Sanford-Burnham Center for Chemical Genomics (SBCCG) Source Affiliation: Sanford-Burnham Medical Research Institute(SBMRI, San Diego, C...
In DepthDetails PCBioAssay
TargetApelin receptor(Homo sapiens (Human))
Sanford-Burnham Center For Chemical Genomics
Curated by PubChem BioAssay
LigandPNGBDBM67155(1-[2-[(4-methoxy-1,3-benzothiazol-2-yl)amino]-4-me...)
Affinity DataIC50: >4.00E+4nM. Assay description: Data Source: Sanford-Burnham Center for Chemical Genomics (SBCCG) Source Affiliation: Sanford- Sanford-Burnham Medical Research Institute(SBMRI, San...
In DepthDetails PCBioAssay