BDBM67314 1-(4-bromophenyl)-2-(3-chloroanilino)ethanone::1-(4-bromophenyl)-2-[(3-chlorophenyl)amino]ethanone::MLS000974601::SMR000496821::cid_877472
SMILES Clc1cccc(NCC(=O)c2ccc(Br)cc2)c1
InChI Key InChIKey=YBAUDKRGULSXJG-UHFFFAOYSA-N
Data  2 IC50  1 EC50
  Tab Delimited (TSV)   2D SDfile   Computed 3D by Vconf -m prep SDfile
Find this compound or compounds like it in BindingDB:
Activity Spreadsheet -- Enzyme Inhibition Constant Data from BindingDB
Found 3 hits for monomerid = 67314
TargetApelin receptor(Homo sapiens (Human))
Sanford-Burnham Center For Chemical Genomics
Curated by PubChem BioAssay
LigandPNGBDBM67314(1-(4-bromophenyl)-2-(3-chloroanilino)ethanone | 1-...)
Affinity DataIC50:  2.12E+3nM. Assay description: Data Source: Sanford-Burnham Center for Chemical Genomics (SBCCG) Source Affiliation: Sanford- Sanford-Burnham Medical Research Institute(SBMRI, San...
In DepthDetails PCBioAssay
TargetProbable global transcription activator SNF2L2(Homo sapiens (Human))
The Scripps Research Institute Molecular Screening Center
Curated by PubChem BioAssay
LigandPNGBDBM67314(1-(4-bromophenyl)-2-(3-chloroanilino)ethanone | 1-...)
Affinity DataEC50:  9.12E+4nM
In DepthDetails PCBioAssay
TargetType-1 angiotensin II receptor(Homo sapiens (Human))
Burnham Center For Chemical Genomics
Curated by PubChem BioAssay
LigandPNGBDBM67314(1-(4-bromophenyl)-2-(3-chloroanilino)ethanone | 1-...)
Affinity DataIC50:  1.50E+4nM. Assay description: Data Source: Sanford-Burnham Center for Chemical Genomics (SBCCG) Source Affiliation: Sanford-Burnham Medical Research Institute(SBMRI, San Diego, C...
In DepthDetails PCBioAssay