BDBM67896 (5E)-5-(3-methylbenzylidene)-2-[N'-(1,7,7-trimethylnorbornan-2-ylidene)hydrazino]-2-thiazolin-4-one::(5E)-5-[(3-methylphenyl)methylidene]-2-[2-(4,7,7-trimethyl-3-bicyclo[2.2.1]heptanylidene)hydrazinyl]-1,3-thiazol-4-one::(5E)-5-[(3-methylphenyl)methylidene]-2-[2-(4,7,7-trimethyl-3-bicyclo[2.2.1]heptanylidene)hydrazinyl]-4-thiazolone::5-(3-methylbenzylidene)-2-[(1,7,7-trimethylbicyclo[2.2.1]hept-2-ylidene)hydrazono]-1,3-thiazolidin-4-one::MLS000544757::SMR000159419::cid_11948856
SMILES [H]C12CCC(C)(C(C1)=NNC1=NC(=O)C(S1)=Cc1cccc(C)c1)C2(C)C
InChI Key InChIKey=KIKZTEFIKRIYPY-UHFFFAOYSA-N
Data  4 IC50
  Tab Delimited (TSV)   2D SDfile   Computed 3D by Vconf -m prep SDfile
Find this compound or compounds like it in BindingDB:
Activity Spreadsheet -- Enzyme Inhibition Constant Data from BindingDB
Found 4 hits for monomerid = 67896
TargetDNA damage-inducible transcript 3 protein(Mus musculus)
Emory University
Curated by PubChem BioAssay
LigandPNGBDBM67896((5E)-5-(3-methylbenzylidene)-2-[N'-(1,7,7-trimethy...)
Affinity DataIC50:  8.98E+3nM. Assay description: NIH Molecular Libraries Screening Centers Network [MLSCN] Emory Chemical Biology Discovery Center in MLSCN Assay provider: Dr. Randal Kaufman, Univer...
In DepthDetails PCBioAssay
TargetDNA damage-inducible transcript 3 protein(Mus musculus)
Emory University
Curated by PubChem BioAssay
LigandPNGBDBM67896((5E)-5-(3-methylbenzylidene)-2-[N'-(1,7,7-trimethy...)
Affinity DataIC50:  8.98E+3nM. Assay description: NIH Molecular Libraries Screening Centers Network [MLSCN] Emory Chemical Biology Discovery Center in MLSCN Assay provider: Dr. Randal Kaufman, Univer...
In DepthDetails PCBioAssay
TargetX-box-binding protein 1(Homo sapiens (Human))
Emory University
Curated by PubChem BioAssay
LigandPNGBDBM67896((5E)-5-(3-methylbenzylidene)-2-[N'-(1,7,7-trimethy...)
Affinity DataIC50:  5.87E+3nM. Assay description: NIH Molecular Libraries Screening Centers Network [MLSCN] Emory Chemical Biology Discovery Center in MLSCN Assay provider: Dr. Randal Kaufman, Univer...
In DepthDetails PCBioAssay
TargetFurin(Homo sapiens (Human))
University Of Pittsburgh
Curated by PubChem BioAssay
LigandPNGBDBM67896((5E)-5-(3-methylbenzylidene)-2-[N'-(1,7,7-trimethy...)
Affinity DataIC50: >5.00E+4nM. Assay description: Official Symbol FURIN and Name: furin (paired basic amino acid cleaving enzyme) [Homo sapiens] Other Aliases: FUR, PACE, PCSK3, SPC1 Other Designati...
In DepthDetails PCBioAssay