BDBM681 BMS-186318 analog 18::[1S-[1R*,2S*(2S*,3R*)]]-[3-[[3-[[(1,1-Dimethylethoxy)-carbonyl]amino]-2-hydroxy-4-[4-[2-(3-methyl-2-oxo-1-imidazolidinyl)ethoxy]phenyl]butyl]amino]-2-::hydroxy-1-(phenylmethyl)propyl]carbamic Acid, 1,1-Dimethylethyl Ester::tert-butyl N-[(2S,3R)-4-{[(2R,3S)-3-{[(tert-butoxy)carbonyl]amino}-2-hydroxy-4-{4-[2-(3-methyl-2-oxoimidazolidin-1-yl)ethoxy]phenyl}butyl]amino}-3-hydroxy-1-phenylbutan-2-yl]carbamate
SMILES CN1CCN(CCOc2ccc(C[C@H](NC(=O)OC(C)(C)C)[C@H](O)CNC[C@@H](O)[C@H](Cc3ccccc3)NC(=O)OC(C)(C)C)cc2)C1=O
InChI Key InChIKey=KQBXKNMHEJHPCA-SYQUUIDJSA-N
Data  1 IC50
  Tab Delimited (TSV)   2D SDfile   Computed 3D by Vconf -m prep SDfile
Find this compound or compounds like it in BindingDB:
Activity Spreadsheet -- Enzyme Inhibition Constant Data from BindingDB
Found 1 hit for monomerid = 681
TargetDimer of Gag-Pol polyprotein [489-587](Human immunodeficiency virus type 1)
Bristol-Myers Squibb
LigandPNGBDBM681(BMS-186318 analog 18 | [1S-[1R*,2S*(2S*,3R*)]]-[3-...)
Affinity DataIC50:  60nMpH: 5.5 T: 2°C. Assay description: IC50 values are determined by inhibition of the cleavage of the peptidic substrate [V-S-Q-N-(beta-naphthylalanine)-P-I-V]. The IC50 value represents ...
In DepthDetails ArticlePubMed