BDBM6815 6-fluoro-18,23-dimethyl-3,13,18-triazahexacyclo[14.7.0.0^{2,10}.0^{4,9}.0^{11,15}.0^{17,21}]tricosa-1(16),2(10),4(9),5,7,11(15),17(21),19,22-nonaene-12,14-dione::indolo[6,7-a]pyrrolo[3,4-c]carbazole deriv. 3hh
SMILES Cc1cc2ccn(C)c2c2c3C(=O)NC(=O)c3c3c4ccc(F)cc4[nH]c3c12
InChI Key InChIKey=SXBXZPMHHKFUPC-UHFFFAOYSA-N
Data  4 IC50
  Tab Delimited (TSV)   2D SDfile   Computed 3D by Vconf -m prep SDfile
Find this compound or compounds like it in BindingDB:
Activity Spreadsheet -- Enzyme Inhibition Constant Data from BindingDB
Found 4 hits for monomerid = 6815
TargetCyclin-dependent kinase 4/G1/S-specific cyclin-D1(Homo sapiens (Human))
Eli Lilly
LigandPNGBDBM6815(6-fluoro-18,23-dimethyl-3,13,18-triazahexacyclo[14...)
Affinity DataIC50:  50nMT: 2°C. Assay description: In vitro CDK assay using purified enzyme, was incubated at room temperature with substrate, and test compounds in the presence of ATP/[gamma-33P]ATP....
In DepthDetails ArticlePubMed
TargetcAMP-dependent protein kinase catalytic subunit alpha(Bos taurus (bovine))
Eli Lilly
LigandPNGBDBM6815(6-fluoro-18,23-dimethyl-3,13,18-triazahexacyclo[14...)
Affinity DataIC50: >2.00E+4nMT: 2°C. Assay description: In vitro kinase assay using purified enzyme, was incubated at room temperature with substrate, and test compounds in the presence of ATP/[gamma-33P]A...
In DepthDetails ArticlePubMed
TargetCyclin-dependent kinase 2/G1/S-specific cyclin-E1(Homo sapiens (Human))
Eli Lilly
LigandPNGBDBM6815(6-fluoro-18,23-dimethyl-3,13,18-triazahexacyclo[14...)
Affinity DataIC50:  23nMT: 2°C. Assay description: In vitro CDK assay using purified enzyme, was incubated at room temperature with substrate, and test compounds in the presence of ATP/[gamma-33P]ATP....
In DepthDetails ArticlePubMed
TargetCyclin-dependent kinase 4/G1/S-specific cyclin-D1(Homo sapiens (Human))
Eli Lilly
LigandPNGBDBM6815(6-fluoro-18,23-dimethyl-3,13,18-triazahexacyclo[14...)
Affinity DataIC50:  6nMT: 2°C. Assay description: In vitro CDK assay using purified enzyme, was incubated at room temperature with substrate, and test compounds in the presence of ATP/[gamma-33P]ATP....
In DepthDetails ArticlePubMed