BDBM68335 1-(4-methylphenyl)-4-oxo-2-sulfanylidene-1,3-diazaspiro[4.5]decane-3-carboxylic acid ethyl ester::4-keto-1-(p-tolyl)-2-thioxo-1,3-diazaspiro[4.5]decane-3-carboxylic acid ethyl ester::BRD-K97464451-001-01-9::cid_3889161::ethyl 1-(4-methylphenyl)-4-oxidanylidene-2-sulfanylidene-1,3-diazaspiro[4.5]decane-3-carboxylate::ethyl 1-(4-methylphenyl)-4-oxo-2-sulfanylidene-1,3-diazaspiro[4.5]decane-3-carboxylate
SMILES CCOC(=O)N1C(=S)N(c2ccc(C)cc2)C2(CCCCC2)C1=O
InChI Key InChIKey=MOGFXVAPEOTVNG-UHFFFAOYSA-N
Data  3 EC50
  Tab Delimited (TSV)   2D SDfile   Computed 3D by Vconf -m prep SDfile
Find this compound or compounds like it in BindingDB:
Activity Spreadsheet -- Enzyme Inhibition Constant Data from BindingDB
Found 3 hits for monomerid = 68335
TargetATP-dependent molecular chaperone HSP82(Candida albicans)
Broad Institute
Curated by PubChem BioAssay
LigandPNGBDBM68335(1-(4-methylphenyl)-4-oxo-2-sulfanylidene-1,3-diaza...)
Affinity DataEC50:  1.36E+3nM. Assay description: Broad Institute: Reversing Antifungal Drug Resistance Project ID: 2037 Keywords: Candida albicans, drug resistance, fluconazole, Hsp90, Calcineurin, ...
In DepthDetails PCBioAssay
TargetSerine/threonine-protein phosphatase(Candida dubliniensis CD36)
Broad Institute
Curated by PubChem BioAssay
LigandPNGBDBM68335(1-(4-methylphenyl)-4-oxo-2-sulfanylidene-1,3-diaza...)
Affinity DataEC50: >2.85E+5nM. Assay description: Keywords: Candida albicans, drug resistance, Fluconazole, calcineurin, stress response Assay Overview: Method for determining if compound acts as Ca...
In DepthDetails PCBioAssay
TargetATP-dependent molecular chaperone HSP82(Candida albicans)
Broad Institute
Curated by PubChem BioAssay
LigandPNGBDBM68335(1-(4-methylphenyl)-4-oxo-2-sulfanylidene-1,3-diaza...)
Affinity DataEC50:  4.05E+4nM. Assay description: Keywords: Candida albicans, drug resistance, Fluconazole, Hsp90, stress response Assay Overview: Method for determining if compound acts as Hsp90 inh...
In DepthDetails PCBioAssay