BDBM68423 5-(4-bromophenyl)-4-(3-ethoxy-4-hydroxy-phenyl)-3-methyl-2,4-dihydropyrrolo[3,4-c]pyrazol-6-one::5-(4-bromophenyl)-4-(3-ethoxy-4-hydroxyphenyl)-3-methyl-2,4-dihydropyrrolo[3,4-c]pyrazol-6-one::5-(4-bromophenyl)-4-(3-ethoxy-4-oxidanyl-phenyl)-3-methyl-2,4-dihydropyrrolo[3,4-c]pyrazol-6-one::MLS000082683::SMR000059772::cid_663245
SMILES CCOc1cc(ccc1O)C1N(C(=O)c2n[nH]c(C)c12)c1ccc(Br)cc1
InChI Key InChIKey=JZLRHKXCRQSFDX-UHFFFAOYSA-N
Data  1 EC50
  Tab Delimited (TSV)   2D SDfile   Computed 3D by Vconf -m prep SDfile
Find this compound or compounds like it in BindingDB:
Activity Spreadsheet -- Enzyme Inhibition Constant Data from BindingDB
Found 1 hit for monomerid = 68423
TargetGlycogen synthase kinase-3 beta(Homo sapiens (Human))
Broad Institute
Curated by PubChem BioAssay
LigandPNGBDBM68423(5-(4-bromophenyl)-4-(3-ethoxy-4-hydroxy-phenyl)-3-...)
Affinity DataEC50: >3.00E+5nM. Assay description: Keywords: GSK3beta, dose response, kinase, inhibition, HTS Assay Overview: The glycogen synthase kinase-3 beta (GSK-3b) is a known master regulator f...
In DepthDetails PCBioAssay