BDBM68535 MLS000049659::N-[2-(3,4-dihydro-1(2H)-quinolinyl)-2-oxoethyl]-N,4-dimethylbenzenesulfonamide (non-preferred name)::N-[2-(3,4-dihydro-2H-quinolin-1-yl)-2-keto-ethyl]-N,4-dimethyl-benzenesulfonamide::N-[2-(3,4-dihydro-2H-quinolin-1-yl)-2-oxidanylidene-ethyl]-N,4-dimethyl-benzenesulfonamide::N-[2-(3,4-dihydro-2H-quinolin-1-yl)-2-oxoethyl]-N,4-dimethylbenzenesulfonamide::SMR000076264::cid_2203342
SMILES CN(CC(=O)N1CCCc2ccccc12)S(=O)(=O)c1ccc(C)cc1
InChI Key InChIKey=ZXKWKSANWWOYEF-UHFFFAOYSA-N
Data  1 EC50
  Tab Delimited (TSV)   2D SDfile   Computed 3D by Vconf -m prep SDfile
Find this compound or compounds like it in BindingDB:
Activity Spreadsheet -- Enzyme Inhibition Constant Data from BindingDB
Found 1 hit for monomerid = 68535
TargetGlycogen synthase kinase-3 beta(Homo sapiens (Human))
Broad Institute
Curated by PubChem BioAssay
LigandPNGBDBM68535(MLS000049659 | N-[2-(3,4-dihydro-1(2H)-quinolinyl)...)
Affinity DataEC50: >3.00E+5nM. Assay description: Keywords: GSK3beta, dose response, kinase, inhibition, HTS Assay Overview: The glycogen synthase kinase-3 beta (GSK-3b) is a known master regulator f...
In DepthDetails PCBioAssay