BDBM68569 1-(2-furoyl)-4-isonicotinoylpiperazine::MLS000066790::SMR000070285::[4-(2-furoyl)piperazino]-(4-pyridyl)methanone::[4-(furan-2-carbonyl)piperazin-1-yl]-pyridin-4-ylmethanone::[4-(furan-2-ylcarbonyl)piperazin-1-yl]-pyridin-4-yl-methanone::[4-[2-furanyl(oxo)methyl]-1-piperazinyl]-pyridin-4-ylmethanone::cid_776707
SMILES O=C(N1CCN(CC1)C(=O)c1ccncc1)c1ccco1
InChI Key InChIKey=QBBAZLIROKFMLW-UHFFFAOYSA-N
Data  1 EC50
  Tab Delimited (TSV)   2D SDfile   Computed 3D by Vconf -m prep SDfile
Find this compound or compounds like it in BindingDB:
Activity Spreadsheet -- Enzyme Inhibition Constant Data from BindingDB
Found 1 hit for monomerid = 68569
TargetGlycogen synthase kinase-3 beta(Homo sapiens (Human))
Broad Institute
Curated by PubChem BioAssay
LigandPNGBDBM68569(1-(2-furoyl)-4-isonicotinoylpiperazine | MLS000066...)
Affinity DataEC50: >3.00E+5nM. Assay description: Keywords: GSK3beta, dose response, kinase, inhibition, HTS Assay Overview: The glycogen synthase kinase-3 beta (GSK-3b) is a known master regulator f...
In DepthDetails PCBioAssay