BDBM6857 6-bromo-20-methoxy-3,13,23-triazahexacyclo[14.7.0.0^{2,10}.0^{4,9}.0^{11,15}.0^{17,22}]tricosa-1(16),2(10),4(9),5,7,11(15),17(22),18,20-nonaene-12,14-dione::Indolocarbazole deriv. 4m
SMILES COc1ccc2c(c1)[nH]c1c3[nH]c4cc(Br)ccc4c3c3C(=O)NC(=O)c3c21
InChI Key InChIKey=JBSMKKXBEWWBIS-UHFFFAOYSA-N
Data  4 IC50
  Tab Delimited (TSV)   2D SDfile   Computed 3D by Vconf -m prep SDfile
Find this compound or compounds like it in BindingDB:
Activity Spreadsheet -- Enzyme Inhibition Constant Data from BindingDB
Found 4 hits for monomerid = 6857
TargetCyclin-dependent kinase 4/G1/S-specific cyclin-D1(Homo sapiens (Human))
Eli Lilly
LigandPNGBDBM6857(6-bromo-20-methoxy-3,13,23-triazahexacyclo[14.7.0....)
Affinity DataIC50:  630nMpH: 7.0 T: 2°C. Assay description: In vitro kinase assay using purified enzyme, was incubated at room temperature with substrate, and test compounds in the presence of ATP/[gamma-33P]A...
In DepthDetails ArticlePubMed
TargetcAMP-dependent protein kinase catalytic subunit alpha(Bos taurus (bovine))
Eli Lilly
LigandPNGBDBM6857(6-bromo-20-methoxy-3,13,23-triazahexacyclo[14.7.0....)
Affinity DataIC50: >2.00E+3nMT: 2°C. Assay description: In vitro kinase assay using purified enzyme, was incubated at room temperature with substrate, and test compounds in the presence of ATP/[gamma-33P]A...
In DepthDetails ArticlePubMed
LigandPNGBDBM6857(6-bromo-20-methoxy-3,13,23-triazahexacyclo[14.7.0....)
Affinity DataIC50: >2.00E+3nMT: 2°C. Assay description: In vitro kinase assay using purified enzyme, was incubated at room temperature with substrate, and test compounds in the presence of ATP/[gamma-33P]A...
In DepthDetails ArticlePubMed
TargetCyclin-dependent kinase 2/G1/S-specific cyclin-E1(Homo sapiens (Human))
Eli Lilly
LigandPNGBDBM6857(6-bromo-20-methoxy-3,13,23-triazahexacyclo[14.7.0....)
Affinity DataIC50: >2.00E+3nMT: 2°C. Assay description: In vitro kinase assay using purified enzyme, was incubated at room temperature with substrate, and test compounds in the presence of ATP/[gamma-33P]A...
In DepthDetails ArticlePubMed