BDBM68646 1-(2-pyridinyl)-3-(3-pyridinyl)urea::1-(2-pyridyl)-3-(3-pyridyl)urea::1-pyridin-2-yl-3-pyridin-3-yl-urea::1-pyridin-2-yl-3-pyridin-3-ylurea::MLS000104821::SMR000054754::cid_783846
SMILES O=C(Nc1cccnc1)Nc1ccccn1
InChI Key InChIKey=DFJGLRLNQAOGLW-UHFFFAOYSA-N
Data  1 EC50
  Tab Delimited (TSV)   2D SDfile   Computed 3D by Vconf -m prep SDfile
Find this compound or compounds like it in BindingDB:
Activity Spreadsheet -- Enzyme Inhibition Constant Data from BindingDB
Found 1 hit for monomerid = 68646
TargetGlycogen synthase kinase-3 beta(Homo sapiens (Human))
Broad Institute
Curated by PubChem BioAssay
LigandPNGBDBM68646(1-(2-pyridinyl)-3-(3-pyridinyl)urea | 1-(2-pyridyl...)
Affinity DataEC50: >3.00E+5nM. Assay description: Keywords: GSK3beta, dose response, kinase, inhibition, HTS Assay Overview: The glycogen synthase kinase-3 beta (GSK-3b) is a known master regulator f...
In DepthDetails PCBioAssay