BDBM68857 (1-naphthalen-1-yl-2,5-dioxopyrrolidin-3-yl) N,N'-diphenylcarbamimidothioate::2-(1-Naphthalen-1-yl-2,5-dioxo-pyrrolidin-3-yl)-1,3-diphenyl-isothiourea::2-[2,5-diketo-1-(1-naphthyl)pyrrolidin-3-yl]-1,3-diphenyl-isothiourea::MLS000558765::N,N'-diphenylcarbamimidothioic acid [1-(1-naphthalenyl)-2,5-dioxo-3-pyrrolidinyl] ester::SMR000174585::[1-naphthalen-1-yl-2,5-bis(oxidanylidene)pyrrolidin-3-yl] N,N'-diphenylcarbamimidothioate::cid_2833595
SMILES Oc1cc(SC(Nc2ccccc2)=Nc2ccccc2)c(O)n1-c1cccc2ccccc12
InChI Key InChIKey=HTJRHVJWSWJXAT-UHFFFAOYSA-N
Data  1 EC50
  Tab Delimited (TSV)   2D SDfile   Computed 3D by Vconf -m prep SDfile
Find this compound or compounds like it in BindingDB:
Activity Spreadsheet -- Enzyme Inhibition Constant Data from BindingDB
Found 1 hit for monomerid = 68857
TargetGlycogen synthase kinase-3 beta(Homo sapiens (Human))
Broad Institute
Curated by PubChem BioAssay
LigandPNGBDBM68857((1-naphthalen-1-yl-2,5-dioxopyrrolidin-3-yl) N,N'-...)
Affinity DataEC50: >3.00E+5nM. Assay description: Keywords: GSK3beta, dose response, kinase, inhibition, HTS Assay Overview: The glycogen synthase kinase-3 beta (GSK-3b) is a known master regulator f...
Ligand InfoPC cidPC sid
In DepthDetails PCBioAssay