BDBM68866 (Z,4E)-2-cyano-4-(1,3,3-trimethyl-2-indolylidene)-2-butenamide::(Z,4E)-2-cyano-4-(1,3,3-trimethylindol-2-ylidene)but-2-enamide::(Z,4E)-2-cyano-4-(1,3,3-trimethylindolin-2-ylidene)but-2-enamide::2-Cyano-4-(1,3,3-trimethyl-1,3-dihydro-indol-2-ylidene)-but-2-enoic acid amide::MLS000556058::SMR000175130::cid_5756548
SMILES CN1\C(=C\C=C(\C#N)C(N)=O)C(C)(C)c2ccccc12
InChI Key InChIKey=JAWZRHSGHFIOEX-VRHZNZDDSA-N
Data  1 EC50
  Tab Delimited (TSV)   2D SDfile   Computed 3D by Vconf -m prep SDfile
Find this compound or compounds like it in BindingDB:
Activity Spreadsheet -- Enzyme Inhibition Constant Data from BindingDB
Found 1 hit for monomerid = 68866
TargetGlycogen synthase kinase-3 beta(Homo sapiens (Human))
Broad Institute
Curated by PubChem BioAssay
LigandPNGBDBM68866((Z,4E)-2-cyano-4-(1,3,3-trimethyl-2-indolylidene)-...)
Affinity DataEC50:  1.55E+4nM. Assay description: Keywords: GSK3beta, dose response, kinase, inhibition, HTS Assay Overview: The glycogen synthase kinase-3 beta (GSK-3b) is a known master regulator f...
In DepthDetails PCBioAssay