BDBM69025 (5-bromanylfuran-2-yl)-(6,7-dimethoxy-1-methyl-3,4-dihydro-1H-isoquinolin-2-yl)methanone::(5-bromo-2-furanyl)-(6,7-dimethoxy-1-methyl-3,4-dihydro-1H-isoquinolin-2-yl)methanone::(5-bromo-2-furyl)-(6,7-dimethoxy-1-methyl-3,4-dihydro-1H-isoquinolin-2-yl)methanone::(5-bromofuran-2-yl)-(6,7-dimethoxy-1-methyl-3,4-dihydro-1H-isoquinolin-2-yl)methanone::2-(5-bromo-2-furoyl)-6,7-dimethoxy-1-methyl-1,2,3,4-tetrahydroisoquinoline::MLS000678714::SMR000269781::cid_2905396
SMILES COc1cc2CCN(C(C)c2cc1OC)C(=O)c1ccc(Br)o1
InChI Key InChIKey=ADNJEBVHGYYVSD-UHFFFAOYSA-N
Data  1 EC50
  Tab Delimited (TSV)   2D SDfile   Computed 3D by Vconf -m prep SDfile
Find this compound or compounds like it in BindingDB:
Activity Spreadsheet -- Enzyme Inhibition Constant Data from BindingDB
Found 1 hit for monomerid = 69025
TargetGlycogen synthase kinase-3 beta(Homo sapiens (Human))
Broad Institute
Curated by PubChem BioAssay
LigandPNGBDBM69025((5-bromanylfuran-2-yl)-(6,7-dimethoxy-1-methyl-3,4...)
Affinity DataEC50: >3.00E+5nM. Assay description: Keywords: GSK3beta, dose response, kinase, inhibition, HTS Assay Overview: The glycogen synthase kinase-3 beta (GSK-3b) is a known master regulator f...
In DepthDetails PCBioAssay